job performance
type: Concept
definition: International research has examined occupational performance and marital status since the early 20th century. Several studies support the notion that higher occupational satisfaction is related to higher relationship satisfaction, although few studies have examined how job performance relates specifically to marital or relationship dissolution. [Source: Cultural Sociology of Divorce: An Encyclopedia; Job Performance]
broader: effects of divorce

effects of divorce
type: Concept
narrower: job performance

concepts
type: Collection
type: ConceptGroup
member: job performance