professional development and standards
type: Concept
narrower: journal of career development

concepts
type: Collection
type: ConceptGroup
member: journal of career development

journal of career development
type: Concept
definition: The first issue of the Journal of Career Development (vol. 1, no. [Source: Encyclopedia of Counseling; Journal of Career Development]
broader: professional development and standards