juvenile crimes/programs/units
type: Concept
definition: Juvenile crime has occurred for centuries, as has the debate regarding the age of criminal responsibility. Before the 20th century, punishment consisted of severe discipline, and children were seen more as property than as people. [Source: Encyclopedia of Law Enforcement; Juvenile crimes/Programs/Units]
broader: tactics

tactics
type: Concept
narrower: juvenile crimes/programs/units

concepts
type: Collection
type: ConceptGroup
member: juvenile crimes/programs/units