health and behavior
type: Concept
narrower: key informants

key informants
type: Concept
definition: The term key informant is best understood in the context of ethnographic or qualitative research in naturalistic settings (LeCompte & Schensul, 1999). These settings are often termed “the field” (DeWalt & DeWalt, 2002; Pelto & Pelto, 1978). [Source: Encyclopedia of Health and Behavior; Key Informants]
broader: health and behavior

concepts
type: Collection
type: ConceptGroup
member: key informants