knowledge is power program
type: Concept
definition: Founded in 1994 by two teachers (Mike Feinberg and Dave Levin), KIPP represents one of the most significant and high-profile efforts at comprehensive school reform in the United States. The KIPP schools did not begin as a comprehensive school reform movement, but over time they impacted the way both traditional and nontraditional educators approached schooling in urban contexts. [Source: Encyclopedia of Educational Reform and Dissent; Knowledge is Power Program (KIPP)]
broader: school types

school types
type: Concept
narrower: knowledge is power program

concepts
type: Collection
type: ConceptGroup
member: knowledge is power program