laboratory tests
type: Concept
definition: Laboratory services form an essential component of health services. They share the same goal with all other components of health services, which is to promote health and to prevent disease. [Source: Encyclopedia of Global Health; Laboratory Tests]
broader: procedures and therapies

procedures and therapies
type: Concept
narrower: laboratory tests

concepts
type: Collection
type: ConceptGroup
member: laboratory tests