landless persons
type: Concept
definition: The plight of landless persons is a global issue, as they are found all across the global South, especially South and Central America, Africa, and South Asia. The term landless persons usually refers to agricultural workers who do not own their own land. [Source: Encyclopedia of Global Studies; Landless Persons]
broader: global demographic change

global demographic change
type: Concept
narrower: landless persons

concepts
type: Collection
type: ConceptGroup
member: landless persons