locality
type: Concept
definition: Locality is another word for place. If one thinks of different possible scales, locality is nearby. [Source: Encyclopedia of Human Geography; Locality]
broader: human geography theory

human geography theory
type: Concept
narrower: locality

concepts
type: Collection
type: ConceptGroup
member: locality