symbols
type: Concept
narrower: logos

concepts
type: Collection
type: ConceptGroup
member: logos

logos
type: Concept
definition: The source, order, or accountable principle—the “telling”—in a discourse. It involves reasoning. [Source: The SAGE Glossary of the Social and Behavioral Sciences; Logos]
broader: symbols