concepts
type: Collection
type: ConceptGroup
member: malariologist

malariologist
type: Concept
definition: In its more exact definition, a malariologist is a health-science worker dedicated to the study and understanding of malaria and its interacting factors in an integral form. These professionals could be physicians, biologists, pharmaceuticals, laboratorists, nurses, public health bachelors or technicians, sociologists, engineers, environmentalists, and geographers, among others, with significant training and experience, working against malaria, particularly in public health control programs. [Source: Encyclopedia of Global Health; Malariologist]
broader: health sciences

health sciences
type: Concept
narrower: malariologist