messianism
type: Concept
definition: Messianism is, among other things, the belief in a savior. African American history has provided researchers and theorists with fertile ground for the discussion of messianism among the oppressed. [Source: Encyclopedia of Black Studies; Messianism]
broader: concepts in black studies

concepts in black studies
type: Concept
narrower: messianism

concepts
type: Collection
type: ConceptGroup
member: messianism