mimesis
type: Concept
definition: A therapeutic skill used by the therapist to join with the family and become like the family members in the manner or content of their communications (e.g., joking with a jovial family or talking slowly and sparsely with a slow-talking family). The therapist also can join with the family mimetically by conveying personal experiences to its members. [Source: The Dictionary of Family Psychology and Family Therapy; mimesis]
broader: social divisions and social groups in consumer culture

social divisions and social groups in consumer culture
type: Concept
narrower: mimesis

concepts
type: Collection
type: ConceptGroup
member: mimesis