concepts
type: Collection
type: ConceptGroup
member: minimal network

issues in organizational structure
type: Concept
narrower: minimal network

minimal network
type: Concept
definition: The minimal network is a form of coordination that operates a synthesis between the hierarchy and the clan. It is an organizational form coordinated by minimal trust that derives from minimal commitment and minimal consensus. [Source: International Encyclopedia of Organization Studies; Minimal Network]
broader: issues in organizational structure