climate models
type: Concept
narrower: modeling of ice ages

concepts
type: Collection
type: ConceptGroup
member: modeling of ice ages

modeling of ice ages
type: Concept
definition: MODELING ICE AGES and their inception can reveal aspects of the climate system that are not able to be measured, and provide a key to the drivers of climate change. Ice age model results can also allow an analysis of the global and regional conditions at that time, and provide a comparison with proxy field evidence. [Source: Encyclopedia of Global Warming and Climate Change; Modeling of Ice Ages]
broader: climate models