concepts
type: Collection
type: ConceptGroup
member: moderation management

recovery
type: Concept
narrower: moderation management

moderation management
type: Concept
definition: Moderation Management (MM) is a harm reduction-focused self-help support group for problem drinkers who want to reduce or stop drinking. MM was founded in 1994 by Audrey Kishline, a housewife from Ann Arbor, Michigan, and incorporated in 1995. [Source: Encyclopedia of Substance Abuse Prevention, Treatment, & Recovery; Moderation Management]
broader: recovery