modern day archaeological techniques
type: Concept
definition: Archaeology is the study of past human behavior through the objects and sites left behind by ancient people. Archaeologists use a variety of techniques to study artifacts, the contexts in which they are found, and even the landscape itself. [Source: Encyclopedia of Consumption and Waste: The Social Science of Garbage; Archaeological Techniques, Modern Day]
broader: archaeology of garbage

archaeology of garbage
type: Concept
narrower: modern day archaeological techniques

concepts
type: Collection
type: ConceptGroup
member: modern day archaeological techniques