motion perception: physiological
type: Concept
definition: Motion is a sine qua non of life. Because of this property, the visual detection of motion is of great significance, particularly for animals. [Source: Encyclopedia of Perception; Motion Perception: Physiological]
broader: visual perception

visual perception
type: Concept
narrower: motion perception: physiological

concepts
type: Collection
type: ConceptGroup
member: motion perception: physiological