multidimensional scaling methods
type: Concept
definition: Introduction The verb to scale means ‘to arrange in a graduated series’ (Webster's, 1961). Multidimensional scaling means arranging people (or objects) in two or more graduated series. [Source: Encyclopedia of Psychological Assessment; Multidimensional Scaling Methods]
broader: theory and methodology

theory and methodology
type: Concept
narrower: multidimensional scaling methods

methods
type: Collection
type: ConceptGroup
member: multidimensional scaling methods