concepts
type: Collection
type: ConceptGroup
member: multinational marketing

marketing ethics
type: Concept
narrower: multinational marketing

multinational marketing
type: Concept
definition: Multinational marketing involves the domestic firm extending its products into multiple foreign markets. Multinational marketing examines the discrete differences between domestic and foreign markets. [Source: Encyclopedia of Business Ethics and Society; Multinational Marketing]
broader: marketing ethics