plastic arts
type: Concept
narrower: mural art

concepts
type: Collection
type: ConceptGroup
member: mural art

mural art
type: Concept
definition: Traditionally art has been viewed as an exalted form, accessible only to those with high social or economic status. This unambiguous, albeit false, assumption has resonance in the present function of contemporary art. [Source: Encyclopedia of Activism and Social Justice; Mural Art]
broader: plastic arts