negro
type: Concept
definition: Outdated term used to refer to African Americans. Derived from the Spanish word for “black,” the term Negro referred to skin color. [Source: Encyclopedia of African American Society; Negro]
broader: population

population
type: Concept
narrower: negro

concepts
type: Collection
type: ConceptGroup
member: negro