murder
type: Concept
narrower: neonaticide

neonaticide
type: Concept
definition: the killing of a neonate or newborn child. In the late 20th century, a spate of neonaticides were committed by teenage girls who had kept their pregnancies secret from their parents and others. [Source: The Concise Dictionary of Crime and Justice; Neonaticide]
broader: murder

concepts
type: Collection
type: ConceptGroup
member: neonaticide