news coverage
type: Concept
definition: Whether and how the reporting of news affects real-world events is a topic of debate. The CNN effect describes the hypothesis that U.S. foreign policy during the 1990s was driven by topics chosen to be shown on the 24-hour television news channel. [Source: The SAGE Glossary of the Social and Behavioral Sciences; News Coverage]
broader: media coverage

media coverage
type: Concept
narrower: news coverage

concepts
type: Collection
type: ConceptGroup
member: news coverage