nose disorders
type: Concept
definition: The nose serves several important functions. Not only is it one of the most prominent facial features, impacting voice tone, but it also filters air entering the lungs, aids in our sense of smell, and protects against infection. [Source: Encyclopedia of Global Health; Nose Disorders]
broader: localized diseases

localized diseases
type: Concept
narrower: nose disorders

concepts
type: Collection
type: ConceptGroup
member: nose disorders