nuclear waste
type: Concept
definition: More than 20 years after the U.S. Congress in 1987 designated Yucca Mountain in western Nevada as the sole geological repository for used, or spent, American nuclear reactor fuel and high-level nuclear waste, the repository still hasn't opened. Ongoing media coverage of nuclear waste issues generally, and the Yucca Mountain proposal specifically, builds on a long history of controversy and a host of complex technical arguments. [Source: Encyclopedia of Science and Technology Communication; Nuclear Waste]
broader: challenges, issues, and controversies

challenges, issues, and controversies
type: Concept
narrower: nuclear waste

concepts
type: Collection
type: ConceptGroup
member: nuclear waste