food
type: Concept
narrower: nuts

concepts
type: Collection
type: ConceptGroup
member: nuts

nuts
type: Concept
definition: Archaeological records show that the consumption of tree nuts and peanuts spans several centuries. Today, a wide variety of tree nuts as well as peanuts (a legume) are consumed. [Source: Encyclopedia of Lifestyle Medicine & Health; Nuts]
broader: food