object perception: physiology
type: Concept
definition: Object perception or object recognition is the process in which visual input is assigned a meaningful interpretation that is available to perceptual awareness. It is fundamental to our ability to interpret and act in the world. [Source: Encyclopedia of Perception; Object Perception: Physiology]
broader: visual perception

visual perception
type: Concept
narrower: object perception: physiology

concepts
type: Collection
type: ConceptGroup
member: object perception: physiology