obsessive compulsive disorder
type: Concept
definition: Obsessive compulsive disorder (OCD) is an anxiety disorder that affects 2 to 3 percent of the U.S. population. [Source: Encyclopedia of Women in Today's World The Multimedia Encyclopedia of Women in Today's World; Obsessive Compulsive Disorder]
broader: psychological influences and outcomes of obesity

psychological influences and outcomes of obesity
type: Concept
narrower: obsessive compulsive disorder

concepts
type: Collection
type: ConceptGroup
member: obsessive compulsive disorder