industrial/commercial consumption and waste
type: Concept
narrower: ocean disposal

concepts
type: Collection
type: ConceptGroup
member: ocean disposal

ocean disposal
type: Concept
definition: Oceans cover nearly three-quarters of the Earth. Humans have relied on oceans for thousands of years as a source of food, transportation, mineral and energy resources, and recreation. [Source: Encyclopedia of Consumption and Waste: The Social Science of Garbage; Ocean Disposal]
broader: industrial/commercial consumption and waste