climate data
type: Concept
narrower: oceanic observations

concepts
type: Collection
type: ConceptGroup
member: oceanic observations

oceanic observations
type: Concept
definition: CLIMATIC OCEANIC OBSERVATIONS are marine meteorological and deep ocean observations that are performed for a long time (at least over a few decades) using specialized océanographie vessels, volunteer merchant ships, buoy arrays, floats, and drifters. Marine meteorological observations are performed over a few centuries. [Source: Encyclopedia of Global Warming and Climate Change; Climatic Data, Oceanic Observations]
broader: climate data