diversion and probation
type: Concept
narrower: offender supervision

concepts
type: Collection
type: ConceptGroup
member: offender supervision

offender supervision
type: Concept
definition: Technically, offender supervision includes all forms of correctional supervision, including incarceration. Typically, however, the term refers to community supervision. [Source: Encyclopedia of Community Corrections; Offender Supervision]
broader: diversion and probation