old maid
type: Concept
definition: Old Maid is traditionally a matching game for two to eight players that is played with a deck of 51 pictorial paper or plastic playing cards. The intent of the game is to match pairs of cards. [Source: Encyclopedia of Play in Today's Society; Old Maid]
broader: card games

card games
type: Concept
narrower: old maid

concepts
type: Collection
type: ConceptGroup
member: old maid