parathyroid disorders
type: Concept
definition: Humans generally have four small parathyroid glands embedded behind their thyroid gland in the neck. Although this is the most common anatomic location, the parathyroid glands can be found in variable places in the neck. [Source: Encyclopedia of Global Health; Parathyroid Disorders]
broader: systemic diseases

systemic diseases
type: Concept
narrower: parathyroid disorders

concepts
type: Collection
type: ConceptGroup
member: parathyroid disorders