party press
type: Concept
definition: The “Party Press era” refers to a period of time (1783–1833) when news editors in the United States received patronage from political parties, usually in the form of government printing contracts. An editor who had limited financial resources would readily endorse a party's candidates and champion its principles. [Source: Encyclopedia of Political Communication; Party Press]
broader: media

media
type: Concept
narrower: party press

concepts
type: Collection
type: ConceptGroup
member: party press