patchwork urbanism
type: Concept
definition: With more than half the world's population having gravitated to urban environments and so much of this urbanization taking place in recent decades, it is little wonder that city landscapes across the globe are being transformed rapidly and dramatically. The form and character of these transformations are continuously reflected in urban scholarship from a variety of subdisciplines, through detailed case studies of particular cities and their comparisons, and also through a range of metaphors and conceptualizations variously heralding a postmodern urbanism, postmetropo-lis, 100-mile city, polycentric city, quartered city, and splintering urbanism, to name but a few. [Source: Encyclopedia of Urban Studies; Patchwork Urbanism]
broader: urban geography

urban geography
type: Concept
narrower: patchwork urbanism

concepts
type: Collection
type: ConceptGroup
member: patchwork urbanism