path analysis
type: Concept
narrower: path diagram

path diagram
type: Concept
definition: A graphic representation of a hypothesized causal model. Also called “flow graph.” For example, the following path diagram shows the effects of educational and other ∗background variables on occupational attainment. [Source: Dictionary of Statistics & Methodology; Path Diagram]
broader: path analysis

methods
type: Collection
type: ConceptGroup
member: path diagram