social network analysis
type: Concept
narrower: paths/walks/cycles

paths/walks/cycles
type: Concept
definition: A network is a set of connected actors, which are displayed with points and lines on a graph. These points and lines may form different configurations of relations between each other, which are analyzed through the relation-based concepts of walks, paths, and cycles. [Source: Encyclopedia of Social Networks; Paths/Walks/Cycles]
broader: social network analysis

concepts
type: Collection
type: ConceptGroup
member: paths/walks/cycles