concepts
type: Collection
type: ConceptGroup
member: penguins

penguins
type: Concept
definition: FROM THE TROPICS to Antarctica, penguins depend on predictable regions of high ocean productivity where their prey aggregate. There are between 16 and 19 species of penguins, all generally restricted to the southern hemisphere, with the greatest species diversity found in New Zealand. [Source: Encyclopedia of Global Warming and Climate Change; Penguins]
broader: effects of climate change

effects of climate change
type: Concept
narrower: penguins