perceptions of sexual intent
type: Concept
definition: People's perceptions of sexual intent are their judgments that others are interested in them as sexual partners. The degree of interest people judge to exist may range from simple recognition (in which others merely notice their potential as partners) to avid pursuit (in which others' desires for them are blatant and conspicuous). [Source: Encyclopedia of Human Relationships; Sexual Intent, Perceptions of]
broader: sexuality

sexuality
type: Concept
narrower: perceptions of sexual intent

concepts
type: Collection
type: ConceptGroup
member: perceptions of sexual intent