perceptual representation
type: Concept
definition: Philosophers and psychologists talk about perceptual states as representations. One of the most important questions in the philosophy of perception is whether and in what sense could perceptual states be considered representations. [Source: Encyclopedia of Perception; Perceptual Representation (Philosophy)]
broader: philosophical approaches

philosophical approaches
type: Concept
narrower: perceptual representation

concepts
type: Collection
type: ConceptGroup
member: perceptual representation