anxiety
type: Concept
narrower: performance anxiety

performance anxiety
type: Concept
definition: The fear that one will not be able to perform sexually. A cycle of anxiety is established such that anxiety creates failure and the failure perpetuates the anxiety. [Source: The Dictionary of Family Psychology and Family Therapy; performance anxiety]
broader: anxiety

concepts
type: Collection
type: ConceptGroup
member: performance anxiety