concepts in educational reform
type: Concept
narrower: performance contracting

performance contracting
type: Concept
definition: Performance contracting is a process that permits companies to investigate alternatives for increasing utility efficiency or exploring innovative educational reform initiatives without bearing the full cost of those endeavors. Educational organizations usually demonstrate examples of efficiency, shared-savings, or cost-savings performance contracting and educational performance contracting. [Source: Encyclopedia of Educational Reform and Dissent; Performance Contracting]
broader: concepts in educational reform

concepts
type: Collection
type: ConceptGroup
member: performance contracting