personal values
type: Concept
definition: Personal values are those values that people adopt as principles that guide their life. They are values precisely because they are valuable to the person. [Source: Encyclopedia of Business Ethics and Society; Values, Personal]
broader: theories of ethics

theories of ethics
type: Concept
narrower: personal values

concepts
type: Collection
type: ConceptGroup
member: personal values