poaching
type: Concept
definition: Poaching is the act of stealing animals or plants from areas in which they are protected. The motive for poaching may be food or economic gain. [Source: Encyclopedia of Environment and Society; Poaching]
broader: animals

animals
type: Concept
narrower: poaching

concepts
type: Collection
type: ConceptGroup
member: poaching