policy advice
type: Concept
definition: Policy advice does not exist in a vacuum. If it did, it would be irrelevant to political affairs, of only abstract interest. [Source: International Encyclopedia of Political Science; Policy Advice]
broader: public policy

public policy
type: Concept
narrower: policy advice

concepts
type: Collection
type: ConceptGroup
member: policy advice