concepts
type: Collection
type: ConceptGroup
member: pope joan

pope joan
type: Concept
definition: Pope Joan is a card game for three to eight players, played with a traditional 52-card deck from which the eight of diamonds has been removed. British in origin, it is an 18th-century member of the Stops family of card games. [Source: Encyclopedia of Play in Today's Society; Pope Joan]
broader: card games

card games
type: Concept
narrower: pope joan