precocity
type: Concept
definition: Precocity is used to indicate an intellectually gifted child's advanced development in cognitive areas. Although the term can refer to advanced performance in any domain, it most frequently is used in conjunction with advanced language and thought. [Source: Encyclopedia of Giftedness, Creativity, and Talent; Precocity]
broader: developmental disorders

developmental disorders
type: Concept
narrower: precocity

concepts
type: Collection
type: ConceptGroup
member: precocity