preparing instructional objectives
type: Concept
definition: Preparing Instructional Objectives by Robert F. Mager was first published in 1962 as Preparing Objectives for Programmed Instruction by Pitman Learning. The publication describes the importance of being explicit when writing instructional objectives, the qualities of useful objectives, and the components of effective instructional objectives. [Source: Encyclopedia of Curriculum Studies; Preparing Instructional Objectives]
broader: publications

publications
type: Concept
narrower: preparing instructional objectives

concepts
type: Collection
type: ConceptGroup
member: preparing instructional objectives