prison nurseries
type: Concept
definition: Prison nurseries are residential units within prisons in which young children of inmates reside, usually with their mothers. Although they are rare in the United States, prison nurseries are commonplace in women's prisons elsewhere throughout the world. [Source: Encyclopedia of Prisons & Correctional Facilities; Prison Nurseries]
broader: prison life

prison life
type: Concept
narrower: prison nurseries

concepts
type: Collection
type: ConceptGroup
member: prison nurseries