program development
type: Concept
definition: The creation, the process, and the strategies that contribute to the generation and outcomes of a program. Program outcomes vary and can include foci that range from physical and cognitive outcomes to those that are social and/or emotional. [Source: The SAGE Glossary of the Social and Behavioral Sciences; Program Development]
broader: organization and administration

organization and administration
type: Concept
narrower: program development

concepts
type: Collection
type: ConceptGroup
member: program development